DemoVoc
type: ConceptScheme

Subject
type: Collection
member: MAXIMUM LIKELIHOOD METHOD
preferred label: Matière @fr

STATISTICAL ANALYSIS
type: Concept
preferred label: ANALYSE STATISTIQUE @fr
related: MAXIMUM LIKELIHOOD METHOD

MAXIMUM LIKELIHOOD METHOD
type: Concept
broader: STATISTICAL ANALYSIS
in scheme: DemoVoc
preferred label: METHODE DU MAXIMUM DE VRAISEMBLANCE @fr
scope note: Méthode d'estimation des paramètres d'un modèle qui rend maximum la probabilité des observations empiriques. @fr