DemoVoc
type: ConceptScheme

Subject
type: Collection
member: ENDOGENOUS MORTALITY
preferred label: Matière @fr

MORTALITY
type: Concept
narrower: ENDOGENOUS MORTALITY
preferred label: MORTALITE @fr

ENDOGENOUS MORTALITY
type: Concept
broader: MORTALITY
in scheme: DemoVoc
preferred label: MORTALITE ENDOGENE @fr
scope note: Mortalité liée aux malformations congénitales, aux traumatismes de l'accouchement et au vieillissement de l'organisme. @fr