DemoVoc
type: ConceptScheme

Subject
type: Collection
member: POLYANDRY
preferred label: Matière @fr

POLYANDRY
type: Concept
broader: POLYGAMY
in scheme: DemoVoc
preferred label: POLYANDRIE @fr
scope note: Fait pour une femme, d’être en union avec plusieurs hommes @fr

POLYGAMY
type: Concept
narrower: POLYANDRY
preferred label: POLYGAMIE @fr