DemoVoc
type: ConceptScheme
has top concept: HUMAN POPULATION

Subject
type: Collection
member: HUMAN POPULATION
preferred label: Matière @fr

HUMAN POPULATION
type: Concept
in scheme: DemoVoc
preferred label: POPULATION HUMAINE @fr
scope note: ATTENTION : A n'utiliser qu'en liaison avec population animale et population végétale dans le domaine de la génétique démographique. Autrement, utiliser POPULATION. @fr
top concept of: DemoVoc