DemoVoc
type: ConceptScheme
has top concept: POSTPONEMENT

Subject
type: Collection
member: POSTPONEMENT
preferred label: Matière @fr

POSTPONEMENT
type: Concept
in scheme: DemoVoc
preferred label: REPORT @fr
scope note: Report d’un événement démographique : maternité, union conjugale, etc... @fr
top concept of: DemoVoc