DemoVoc
type: ConceptScheme
has top concept: ACTIVITY RATIO

Subject
type: Collection
member: ACTIVITY RATIO
preferred label: Matière @fr

ACTIVITY RATIO
type: Concept
alternative label: PARTICIPATION RATE
in scheme: DemoVoc
preferred label: TAUX D'ACTIVITE @fr
related: WORKING LIFE
scope note: Proportion des membres d'un groupe faisant partie de la population active. @fr
top concept of: DemoVoc

WORKING LIFE
type: Concept
preferred label: VIE ACTIVE @fr
related: ACTIVITY RATIO