DemoVoc
type: ConceptScheme
has top concept: MIGRATION RATE

Subject
type: Collection
member: MIGRATION RATE
preferred label: Matière @fr

MIGRATION
type: Concept
related: MIGRATION RATE

MIGRATION RATE
type: Concept
in scheme: DemoVoc
preferred label: TAUX DE MIGRATION @fr
related: MIGRATION
scope note: Rapport des migrations durant une année à la population moyenne de cette année. @fr
top concept of: DemoVoc