DemoVoc
type: ConceptScheme
has top concept: FRENCH UNION

Geography
type: Collection
member: FRENCH UNION
preferred label: Géographie @fr

FRENCH UNION
type: Concept
in scheme: DemoVoc
preferred label: UNION FRANCAISE @fr
related: FRENCH OVERSEAS DEPARTMENTS AND TERRITORIES
scope note: Nom donné par la Constitution de 1946 à l'ensemble formé par la France et les pays d'outre-mer. L'Union française fut remplacée en 1958 par la Communauté. @fr
top concept of: DemoVoc

FRENCH OVERSEAS DEPARTMENTS AND TERRITORIES
type: Concept
preferred label: DOM-TOM @fr
related: FRENCH UNION