DemoVoc
type: ConceptScheme
has top concept: EUGENISME

Matière
type: Collection
member: EUGENISME
preferred label: Subject @en

EUGENISME
type: Concept
alternative label: EUGENIQUE
in scheme: DemoVoc
preferred label: EUGENICS @en
scope note: Théorie sociale fondée sur l'eugénique, science des conditions favorables au maintien de la qualité de l'espèce humaine.
top concept of: DemoVoc