DemoVoc
type: ConceptScheme

Subject
type: Collection
member: DIFFERENTIAL FERTILITY
preferred label: Matière @fr

FERTILITY
type: Concept
narrower: DIFFERENTIAL FERTILITY
preferred label: FECONDITE @fr

DIFFERENTIAL FERTILITY
type: Concept
broader: FERTILITY
in scheme: DemoVoc
preferred label: FECONDITE DIFFERENTIELLE @fr
scope note: Différence de fécondité entre sous-groupes d'une population. @fr