DemoVoc
type: ConceptScheme
has top concept: POPULATION AUTOCHTONE

POPULATION AUTOCHTONE
type: Concept
alternative label: AUTOCHTONE
alternative label: ABORIGINAL POPULATION @en
alternative label: ABORIGINES @en
alternative label: INDIGENE
alternative label: ABORIGENE
preferred label: INDIGENOUS POPULATION @en
in scheme: DemoVoc
related: RESERVE INDIGENE
scope note: S'applique aux personnes relevant des groupes ethniques qui, à l'origine, ont peuplé le pays dans lequel elles vivent.
top concept of: DemoVoc

RESERVE INDIGENE
type: Concept
preferred label: NATIVE RESERVATIONS @en
related: POPULATION AUTOCHTONE

Matière
type: Collection
preferred label: Subject @en
member: POPULATION AUTOCHTONE