DemoVoc
type: ConceptScheme

DIFFERENTIAL FERTILITY
type: Concept
scope note: Différence de fécondité entre sous-groupes d'une population. @fr
broader: FERTILITY
in scheme: DemoVoc
preferred label: FECONDITE DIFFERENTIELLE @fr

FERTILITY
type: Concept
preferred label: FECONDITE @fr
narrower: DIFFERENTIAL FERTILITY

Subject
type: Collection
preferred label: Matière @fr
member: DIFFERENTIAL FERTILITY