DemoVoc
type: ConceptScheme
has top concept: INTEGRATION

INTEGRATION
scope note: Pour les questions d'immigration, utiliser "INTEGRATION DES IMMIGRES". @fr
top concept of: DemoVoc
related: SOCIAL EXCLUSION
in scheme: DemoVoc
type: Concept

SOCIAL EXCLUSION
preferred label: EXCLUSION @fr
type: Concept
related: INTEGRATION

Subject
preferred label: Matière @fr
type: Collection
member: INTEGRATION