MORTALITY
preferred label: MORTALITE @fr
type: Concept
narrower: ENDOGENOUS MORTALITY

DemoVoc
type: ConceptScheme

ENDOGENOUS MORTALITY
scope note: Mortalité liée aux malformations congénitales, aux traumatismes de l'accouchement et au vieillissement de l'organisme. @fr
broader: MORTALITY
in scheme: DemoVoc
preferred label: MORTALITE ENDOGENE @fr
type: Concept

Subject
preferred label: Matière @fr
type: Collection
member: ENDOGENOUS MORTALITY