ACTIVITY RATIO
scope note: Proportion des membres d'un groupe faisant partie de la population active. @fr
top concept of: DemoVoc
alternative label: PARTICIPATION RATE
related: WORKING LIFE
in scheme: DemoVoc
preferred label: TAUX D'ACTIVITE @fr
type: Concept

DemoVoc
type: ConceptScheme
has top concept: ACTIVITY RATIO

WORKING LIFE
preferred label: VIE ACTIVE @fr
type: Concept
related: ACTIVITY RATIO

Subject
preferred label: Matière @fr
type: Collection
member: ACTIVITY RATIO