AFRIQUE OCCIDENTALE FRANCAISE
scope note: Ancienne fédération des colonies françaises de l'Ouest africain qui, de 1895 à 1958, groupait la circonscription de Dakar, les territoires du Sénégal, la Guinée, la Côte-d'Ivoire, le Soudan, le Dahomey, la Haute-Volta, la Mauritanie et le Niger.
top concept of: DemoVoc
related: AFRIQUE
in scheme: DemoVoc
preferred label: FRENCH WEST AFRICA @en
type: Concept

Géographie
preferred label: Geography @en
type: Collection
member: AFRIQUE OCCIDENTALE FRANCAISE

DemoVoc
type: ConceptScheme
has top concept: AFRIQUE OCCIDENTALE FRANCAISE

AFRIQUE
preferred label: AFRICA @en
type: Concept
related: AFRIQUE OCCIDENTALE FRANCAISE