DemoVoc
type: ConceptScheme
has top concept: DEPOPULATION

RURAL DEPOPULATION
preferred label: DEPEUPLEMENT RURAL @fr
type: Concept
broader: DEPOPULATION

DEPOPULATION
scope note: Diminution de population d'un territoire, d'une région, ou d'une ville causée essentiellement par l'émigration. @fr
top concept of: DemoVoc
narrower: RURAL DEPOPULATION
in scheme: DemoVoc
preferred label: DEPEUPLEMENT @fr
type: Concept

Subject
preferred label: Matière @fr
type: Collection
member: DEPOPULATION