DemoVoc
type: ConceptScheme

DOMESTIC WORKER
scope note: Concerne les emplois rémunérés de service à la personne, dans le cadre de l'activité domestique. A distinguer de TRAVAIL DOMESTIQUE (voir à ce descripteur pour la définition). @fr
broader: OCCUPATIONS
in scheme: DemoVoc
preferred label: EMPLOI DOMESTIQUE @fr
type: Concept

OCCUPATIONS
preferred label: PROFESSION @fr
type: Concept
narrower: DOMESTIC WORKER

Subject
preferred label: Matière @fr
type: Collection
member: DOMESTIC WORKER