DemoVoc
type: ConceptScheme
has top concept: EUGENISME

EUGENISME
scope note: Théorie sociale fondée sur l'eugénique, science des conditions favorables au maintien de la qualité de l'espèce humaine.
top concept of: DemoVoc
alternative label: EUGENIQUE
in scheme: DemoVoc
preferred label: EUGENICS @en
type: Concept

Matière
preferred label: Subject @en
type: Collection
member: EUGENISME