DemoVoc
type: ConceptScheme

NATURAL FERTILITY
scope note: Fécondité en l'absence de toute méthode de prévention des naissances. @fr
broader: FERTILITY
in scheme: DemoVoc
preferred label: FECONDITE NATURELLE @fr
type: Concept

Subject
preferred label: Matière @fr
type: Collection
member: NATURAL FERTILITY

FERTILITY
preferred label: FECONDITE @fr
type: Concept
narrower: NATURAL FERTILITY